Reaction Details
TargetSigma non-opioid intracellular receptor 1
LigandBDBM50107208
Substrate/Competitorn/a
Meas. Tech.ChEMBL_223691 (CHEMBL846101)
Ki 3.93±n/a nM
Citation Huang, YHammond, PSWu, LMach, RH Synthesis and structure-activity relationships of N-(1-benzylpiperidin-4-yl)arylacetamide analogues as potent sigma1 receptor ligands. J Med Chem44:4404-15 (2001) Sigma non-opioid intracellular receptor 1
Name:Sigma non-opioid intracellular receptor 1
Type:Enzyme Catalytic Domain
Mol. Mass.:25124.85
Organism:Homo sapiens (Human)
Description:Q99720
Residue:223
BDBM50107208
NameBDBM50107208
Synonyms:CHEMBL138688 | N-(1-Benzyl-piperidin-4-yl)-2-thiophen-2-yl-acetamide
TypeSmall organic molecule
Emp. Form.C18H22N2OS
Mol. Mass.314.445
SMILESO=C(Cc1cccs1)NC1CCN(Cc2ccccc2)CC1