Reaction Details
TargetSigma non-opioid intracellular receptor 1
LigandBDBM50107227
Substrate/Competitorn/a
Meas. Tech.ChEMBL_223691 (CHEMBL846101)
Ki 3.49±n/a nM
Citation Huang, YHammond, PSWu, LMach, RH Synthesis and structure-activity relationships of N-(1-benzylpiperidin-4-yl)arylacetamide analogues as potent sigma1 receptor ligands. J Med Chem44:4404-15 (2001) Sigma non-opioid intracellular receptor 1
Name:Sigma non-opioid intracellular receptor 1
Type:Enzyme Catalytic Domain
Mol. Mass.:25124.85
Organism:Homo sapiens (Human)
Description:Q99720
Residue:223
BDBM50107227
NameBDBM50107227
Synonyms:2-(3-Bromo-phenyl)-N-[1-(3-iodo-benzyl)-piperidin-4-yl]-acetamide | CHEMBL337796
TypeSmall organic molecule
Emp. Form.C20H22BrIN2O
Mol. Mass.513.21
SMILESBrc1cccc(CC(=O)NC2CCN(Cc3cccc(I)c3)CC2)c1