Reaction Details
Target5-hydroxytryptamine receptor 1A
LigandBDBM50107240
Substrate/Competitorn/a
Meas. Tech.ChEMBL_918 (CHEMBL615766)
Ki 0.23±n/a nM
Citation Perrone, RBerardi, FColabufo, NALeopoldo, MLacivita, ETortorella, VLeonardi, APoggesi, ETesta, R trans-4-[4-(Methoxyphenyl)cyclohexyl]-1-arylpiperazines: a new class of potent and selective 5-HT(1A) receptor ligands as conformationally constrained analogues of 4-[3-(5-methoxy-1,2,3,4-tetrahydronaphthalen-1-yl)propyl]-1-arylpiperazines. J Med Chem44:4431-42 (2001) 5-hydroxytryptamine receptor 1A
Name:5-hydroxytryptamine receptor 1A
Type:n/a
Mol. Mass.:46122.49
Organism:Homo sapiens (Human)
Description:n/a
Residue:422
BDBM50107240
NameBDBM50107240
Synonyms:CHEMBL344432 | [3-(5-Methoxy-1,2,3,4-tetrahydro-naphthalen-1-yl)-propyl]-[2-(pyridin-2-yloxy)-ethyl]-amine
TypeSmall organic molecule
Emp. Form.C21H28N2O2
Mol. Mass.340.4592
SMILESCOc1cccc2C(CCCNCCOc3ccccn3)CCCc12