Reaction Details
TargetAlpha-1A adrenergic receptor
LigandBDBM50033852
Substrate/Competitorn/a
Meas. Tech.ChEMBL_30102 (CHEMBL642029)
Ki 0.33±n/a nM
Citation Perrone, RBerardi, FColabufo, NALeopoldo, MLacivita, ETortorella, VLeonardi, APoggesi, ETesta, R trans-4-[4-(Methoxyphenyl)cyclohexyl]-1-arylpiperazines: a new class of potent and selective 5-HT(1A) receptor ligands as conformationally constrained analogues of 4-[3-(5-methoxy-1,2,3,4-tetrahydronaphthalen-1-yl)propyl]-1-arylpiperazines. J Med Chem44:4431-42 (2001) Alpha-1A adrenergic receptor
Name:Alpha-1A adrenergic receptor
Type:Cell-surface receptors
Mol. Mass.:51511.67
Organism:Homo sapiens (Human)
Description:P35348
Residue:466
BDBM50033852
NameBDBM50033852
Synonyms:1-[3-(5-Methoxy-1,2,3,4-tetrahydro-naphthalen-1-yl)-propyl]-4-pyridin-2-yl-piperazine | CHEMBL444590
TypeSmall organic molecule
Emp. Form.C23H31N3O
Mol. Mass.365.5117
SMILESCOc1cccc2C(CCCN3CCN(CC3)c3ccccn3)CCCc12