Reaction Details
TargetGlucocorticoid receptor
LigandBDBM50107359
Substrate/Competitorn/a
Meas. Tech.ChEMBL_44515 (CHEMBL658539)
EC50 405±n/a nM
Citation Elmore, SWCoghlan, MJAnderson, DDPratt, JKGreen, BEWang, AXStashko, MALin, CWTyree, CMMiner, JNJacobson, PBWilcox, DMLane, BC Nonsteroidal selective glucocorticoid modulators: the effect of C-5 alkyl substitution on the transcriptional activation/repression profile of 2,5-dihydro-10-methoxy-2,2,4-trimethyl-1H-[1]benzopyrano[3,4-f]quinolines. J Med Chem44:4481-91 (2001) Glucocorticoid receptor
Name:Glucocorticoid receptor
Type:Enzyme
Mol. Mass.:85656.87
Organism:Homo sapiens (Human)
Description:P04150
Residue:777
BDBM50107359
NameBDBM50107359
Synonyms:5-Butyl-10-methoxy-2,2,4-trimethyl-2,5-dihydro-1H-6-oxa-1-aza-chrysene | CHEMBL140336
TypeSmall organic molecule
Emp. Form.C24H29NO2
Mol. Mass.363.4926
SMILESCCCCC1Oc2cccc(OC)c2-c2ccc3NC(C)(C)C=C(C)c3c12