Reaction Details
TargetPlatelet-activating factor acetylhydrolase
LigandBDBM50107480
Substrate/Competitorn/a
Meas. Tech.ChEBML_101009
IC50 0.200000±n/a nM
Citation Boyd, HFFell, SCHickey, DMIfe, RJLeach, CAMacphee, CHMilliner, KJPinto, ILRawlings, DASmith, SAStansfield, IGStanway, SJTheobald, CJWhittaker, CM Potent, orally active inhibitors of lipoprotein-associated phospholipase A(2): 1-(biphenylmethylamidoalkyl)-pyrimidones. Bioorg Med Chem Lett12:51-5 (2001) Platelet-activating factor acetylhydrolase
Name:Platelet-activating factor acetylhydrolase
Type:PROTEIN
Mol. Mass.:50084.41
Organism:Homo sapiens (Human)
Description:ChEMBL_156212
Residue:441
BDBM50107480
NameBDBM50107480
Synonyms:CHEMBL348243 | N-(4'-Chloro-biphenyl-4-ylmethyl)-2-[2-(4-fluoro-benzylsulfanyl)-4-oxo-5-(2-piperazin-1-yl-pyrimidin-5-ylmethyl)-4H-pyrimidin-1-yl]-N-methyl-acetamide
TypeSmall organic molecule
Emp. Form.C36H35ClFN7O2S
Mol. Mass.684.225
SMILESCN(Cc1ccc(cc1)-c1ccc(Cl)cc1)C(=O)Cn1cc(Cc2cnc(nc2)N2CCNCC2)c(=O)nc1SCc1ccc(F)cc1