Reaction Details
TargetPlatelet-activating factor acetylhydrolase
LigandBDBM50107491
Substrate/Competitorn/a
Meas. Tech.ChEBML_101009
IC50 1.7±n/a nM
Citation Boyd, HFFell, SCHickey, DMIfe, RJLeach, CAMacphee, CHMilliner, KJPinto, ILRawlings, DASmith, SAStansfield, IGStanway, SJTheobald, CJWhittaker, CM Potent, orally active inhibitors of lipoprotein-associated phospholipase A(2): 1-(biphenylmethylamidoalkyl)-pyrimidones. Bioorg Med Chem Lett12:51-5 (2001) Platelet-activating factor acetylhydrolase
Name:Platelet-activating factor acetylhydrolase
Type:PROTEIN
Mol. Mass.:50084.41
Organism:Homo sapiens (Human)
Description:ChEMBL_156212
Residue:441
BDBM50107491
NameBDBM50107491
Synonyms:CHEMBL149644 | N-(4'-Chloro-biphenyl-4-ylmethyl)-2-{2-(4-fluoro-benzylsulfanyl)-5-[2-(4-methyl-piperazin-1-yl)-pyrimidin-5-ylmethyl]-4-oxo-4H-pyrimidin-1-yl}-N-methyl-acetamide
TypeSmall organic molecule
Emp. Form.C37H37ClFN7O2S
Mol. Mass.698.252
SMILESCN(Cc1ccc(cc1)-c1ccc(Cl)cc1)C(=O)Cn1cc(Cc2cnc(nc2)N2CCN(C)CC2)c(=O)nc1SCc1ccc(F)cc1