Reaction Details
TargetPlatelet-activating factor acetylhydrolase
LigandBDBM50107503
Substrate/Competitorn/a
Meas. Tech.ChEBML_101009
IC50 4±n/a nM
Citation Boyd, HFFell, SCHickey, DMIfe, RJLeach, CAMacphee, CHMilliner, KJPinto, ILRawlings, DASmith, SAStansfield, IGStanway, SJTheobald, CJWhittaker, CM Potent, orally active inhibitors of lipoprotein-associated phospholipase A(2): 1-(biphenylmethylamidoalkyl)-pyrimidones. Bioorg Med Chem Lett12:51-5 (2001) Platelet-activating factor acetylhydrolase
Name:Platelet-activating factor acetylhydrolase
Type:PROTEIN
Mol. Mass.:50084.41
Organism:Homo sapiens (Human)
Description:ChEMBL_156212
Residue:441
BDBM50107503
NameBDBM50107503
Synonyms:CHEMBL153681 | N-Biphenyl-4-ylmethyl-2-[2-(4-fluoro-benzylsulfanyl)-4-oxo-5-pyrimidin-5-ylmethyl-4H-pyrimidin-1-yl]-acetamide
TypeSmall organic molecule
Emp. Form.C31H26FN5O2S
Mol. Mass.551.634
SMILESFc1ccc(CSc2nc(=O)c(Cc3cncnc3)cn2CC(=O)NCc2ccc(cc2)-c2ccccc2)cc1