Reaction Details
TargetPlatelet-activating factor acetylhydrolase
LigandBDBM50107502
Substrate/Competitorn/a
Meas. Tech.ChEBML_101009
IC50 5±n/a nM
Citation Boyd, HFFell, SCHickey, DMIfe, RJLeach, CAMacphee, CHMilliner, KJPinto, ILRawlings, DASmith, SAStansfield, IGStanway, SJTheobald, CJWhittaker, CM Potent, orally active inhibitors of lipoprotein-associated phospholipase A(2): 1-(biphenylmethylamidoalkyl)-pyrimidones. Bioorg Med Chem Lett12:51-5 (2001) Platelet-activating factor acetylhydrolase
Name:Platelet-activating factor acetylhydrolase
Type:PROTEIN
Mol. Mass.:50084.41
Organism:Homo sapiens (Human)
Description:ChEMBL_156212
Residue:441
BDBM50107502
NameBDBM50107502
Synonyms:CHEMBL150336 | N-Biphenyl-4-ylmethyl-2-[2-(4-fluoro-benzylsulfanyl)-5-(1-methyl-1H-pyrazol-4-ylmethyl)-4-oxo-4H-pyrimidin-1-yl]-N-methyl-acetamide
TypeSmall organic molecule
Emp. Form.C32H30FN5O2S
Mol. Mass.567.676
SMILESCN(Cc1ccc(cc1)-c1ccccc1)C(=O)Cn1cc(Cc2cnn(C)c2)c(=O)nc1SCc1ccc(F)cc1