Reaction Details
TargetPlatelet-activating factor acetylhydrolase
LigandBDBM50107512
Substrate/Competitorn/a
Meas. Tech.ChEBML_101009
IC50 0.200000±n/a nM
Citation Boyd, HFFell, SCHickey, DMIfe, RJLeach, CAMacphee, CHMilliner, KJPinto, ILRawlings, DASmith, SAStansfield, IGStanway, SJTheobald, CJWhittaker, CM Potent, orally active inhibitors of lipoprotein-associated phospholipase A(2): 1-(biphenylmethylamidoalkyl)-pyrimidones. Bioorg Med Chem Lett12:51-5 (2001) Platelet-activating factor acetylhydrolase
Name:Platelet-activating factor acetylhydrolase
Type:PROTEIN
Mol. Mass.:50084.41
Organism:Homo sapiens (Human)
Description:ChEMBL_156212
Residue:441
BDBM50107512
NameBDBM50107512
Synonyms:2-[2-(4-Fluoro-benzylsulfanyl)-5-(2-methoxy-pyrimidin-5-ylmethyl)-4-oxo-4H-pyrimidin-1-yl]-N-methyl-N-(4'-trifluoromethyl-biphenyl-4-ylmethyl)-acetamide | CHEMBL150446
TypeSmall organic molecule
Emp. Form.C34H29F4N5O3S
Mol. Mass.663.684
SMILESCOc1ncc(Cc2cn(CC(=O)N(C)Cc3ccc(cc3)-c3ccc(cc3)C(F)(F)F)c(SCc3ccc(F)cc3)nc2=O)cn1