Reaction Details
TargetProstaglandin G/H synthase 2
LigandBDBM50107530
Substrate/Competitorn/a
Meas. Tech.ChEBML_159762
IC50 20±n/a nM
Citation Hashimoto, HMaeda, KOzawa, KHaruta, JWakitani, K 4-Aryl/cycloalkyl-5-phenyloxazole derivatives as selective COX-2 inhibitors. Bioorg Med Chem Lett12:65-8 (2001) Prostaglandin G/H synthase 2
Name:Prostaglandin G/H synthase 2
Type:Enzyme
Mol. Mass.:69003.89
Organism:Homo sapiens (Human)
Description:Recombinant Cox-2 provided by Cayman (Cayman Chemical Co.,Ann Arbor, MI).
Residue:604
BDBM50107530
NameBDBM50107530
Synonyms:4-[4-(5-Chloro-thiophen-2-yl)-2-methyl-oxazol-5-yl]-benzenesulfonamide | CHEMBL350422
TypeSmall organic molecule
Emp. Form.C14H11ClN2O3S2
Mol. Mass.354.832
SMILESCc1nc(-c2ccc(Cl)s2)c(o1)-c1ccc(cc1)S(N)(=O)=O