Reaction Details
TargetEndothelin-1 receptor
LigandBDBM50107567
Substrate/Competitorn/a
Meas. Tech.ChEBML_65801
IC50 0.026000±n/a nM
Citation Morimoto, HShimadzu, HHosaka, TKawase, YYasuda, KKikkawa, KYamauchi-Kohno, RYamada, K Modifications and structure-activity relationships at the 2-position of 4-sulfonamidopyrimidine derivatives as potent endothelin antagonists. Bioorg Med Chem Lett12:81-4 (2001) Endothelin-1 receptor
Name:Endothelin-1 receptor
Type:PROTEIN
Mol. Mass.:48707.29
Organism:Sus scrofa
Description:ChEMBL_65803
Residue:427
BDBM50107567
NameBDBM50107567
Synonyms:CHEMBL170908 | N-[6-[2-(5-Bromo-pyrimidin-2-yloxy)-ethoxy]-5-(2-methoxy-phenoxy)-2-propyl-pyrimidin-4-yl]-4-tert-butyl-benzenesulfonamide
TypeSmall organic molecule
Emp. Form.C30H34BrN5O6S
Mol. Mass.672.59
SMILESCCCc1nc(NS(=O)(=O)c2ccc(cc2)C(C)(C)C)c(Oc2ccccc2OC)c(OCCOc2ncc(Br)cn2)n1