Reaction Details
TargetMatrix metalloproteinase-9
LigandBDBM50107583
Substrate/Competitorn/a
Meas. Tech.ChEBML_105370
Ki<2.1±n/a nM
Citation Yao, WChao, MWasserman, ZRLiu, RQCovington, MBNewton, RChrist, DWexler, RRDecicco, CP Potent P1' biphenylmethyl substituted aggrecanase inhibitors. Bioorg Med Chem Lett12:101-4 (2001) Matrix metalloproteinase-9
Name:Matrix metalloproteinase-9
Type:Enzyme
Mol. Mass.:78452.28
Organism:Homo sapiens (Human)
Description:P14780
Residue:707
BDBM50107583
NameBDBM50107583
Synonyms:(R)-2-(3'-Fluoro-biphenyl-4-ylmethyl)-N*4*-hydroxy-N*1*-((1S,2R)-2-hydroxy-indan-1-yl)-succinamide | CHEMBL8496
TypeSmall organic molecule
Emp. Form.C26H25FN2O4
Mol. Mass.448.4861
SMILESONC(=O)C[C@@H](Cc1ccc(cc1)-c1cccc(F)c1)C(=O)N[C@@H]1[C@H](O)Cc2ccccc12