Reaction Details
TargetMuscarinic acetylcholine receptor M1
LigandBDBM50107707
Substrate/Competitorn/a
Meas. Tech.ChEMBL_138408 (CHEMBL744770)
Ki 20±n/a nM
Citation Rajeswaran, WGCao, YHuang, XPWroblewski, MEColclough, TLee, SLiu, FNagy, PIEllis, JLevine, BANocka, KHMesser, WS Design, synthesis, and biological characterization of bivalent 1-methyl-1,2,5,6-tetrahydropyridyl-1,2,5-thiadiazole derivatives as selective muscarinic agonists. J Med Chem44:4563-76 (2001) Muscarinic acetylcholine receptor M1
Name:Muscarinic acetylcholine receptor M1
Type:Protein
Mol. Mass.:51442.54
Organism:Homo sapiens (Human)
Description:P11229
Residue:460
BDBM50107707
NameBDBM50107707
Synonyms:1,2-di[4-(1-methyl-1,2,3,6-tetrahydro-5-pyridinyl)-1,2,5-thiadiazol-3-ylsulfanyl]ethane | CHEMBL343055
TypeSmall organic molecule
Emp. Form.C18H24N6S4
Mol. Mass.452.683
SMILESCN1CCC=C(C1)c1nsnc1SCCSc1nsnc1C1=CCCN(C)C1