Reaction Details
TargetApolipoprotein B-100
LigandBDBM50107770
Substrate/Competitorn/a
Meas. Tech.ChEMBL_217986 (CHEMBL824105)
IC50 3±n/a nM
Citation Ksander, GMdeJesus, RYuan, AFink, CMoskal, MCarlson, EKukkola, PBilci, NWallace, ENeubert, AFeldman, DMogelesky, TPoirier, KJeune, MSteele, RWasvery, JStephan, ZCahill, EWebb, RNavarrete, ALee, WGibson, JAlexander, NSharif, HHospattankar, A Diaminoindanes as microsomal triglyceride transfer protein inhibitors. J Med Chem44:4677-87 (2001) Apolipoprotein B-100
Name:Apolipoprotein B-100
Type:PROTEIN
Mol. Mass.:515630.53
Organism:Homo sapiens (Human)
Description:ChEMBL_217986
Residue:4563
BDBM50107770
NameBDBM50107770
Synonyms:4'-Chloro-6-methyl-biphenyl-2-carboxylic acid [2-(thiophene-2-sulfonylamino)-indan-5-yl]-amide | CHEMBL423194
TypeSmall organic molecule
Emp. Form.C27H23ClN2O3S2
Mol. Mass.523.066
SMILESCc1cccc(C(=O)Nc2ccc3CC(Cc3c2)NS(=O)(=O)c2cccs2)c1-c1ccc(Cl)cc1