Reaction Details
TargetApolipoprotein B-100
LigandBDBM50107785
Substrate/Competitorn/a
Meas. Tech.ChEMBL_217986 (CHEMBL824105)
IC50 2.4±n/a nM
Citation Ksander, GMdeJesus, RYuan, AFink, CMoskal, MCarlson, EKukkola, PBilci, NWallace, ENeubert, AFeldman, DMogelesky, TPoirier, KJeune, MSteele, RWasvery, JStephan, ZCahill, EWebb, RNavarrete, ALee, WGibson, JAlexander, NSharif, HHospattankar, A Diaminoindanes as microsomal triglyceride transfer protein inhibitors. J Med Chem44:4677-87 (2001) Apolipoprotein B-100
Name:Apolipoprotein B-100
Type:PROTEIN
Mol. Mass.:515630.53
Organism:Homo sapiens (Human)
Description:ChEMBL_217986
Residue:4563
BDBM50107785
NameBDBM50107785
Synonyms:CHEMBL341974 | {2-[(4,6-Dimethyl-4'-trifluoromethyl-biphenyl-2-carbonyl)-amino]-6,7,8,9-tetrahydro-5H-benzocyclohepten-7-yl}-carbamic acid methyl ester
TypeSmall organic molecule
Emp. Form.C29H29F3N2O3
Mol. Mass.510.5474
SMILESCOC(=O)NC1CCc2ccc(NC(=O)c3cc(C)cc(C)c3-c3ccc(cc3)C(F)(F)F)cc2CC1