Reaction Details
TargetApolipoprotein B-100
LigandBDBM50107768
Substrate/Competitorn/a
Meas. Tech.ChEMBL_217986 (CHEMBL824105)
IC50 16±n/a nM
Citation Ksander, GMdeJesus, RYuan, AFink, CMoskal, MCarlson, EKukkola, PBilci, NWallace, ENeubert, AFeldman, DMogelesky, TPoirier, KJeune, MSteele, RWasvery, JStephan, ZCahill, EWebb, RNavarrete, ALee, WGibson, JAlexander, NSharif, HHospattankar, A Diaminoindanes as microsomal triglyceride transfer protein inhibitors. J Med Chem44:4677-87 (2001) Apolipoprotein B-100
Name:Apolipoprotein B-100
Type:PROTEIN
Mol. Mass.:515630.53
Organism:Homo sapiens (Human)
Description:ChEMBL_217986
Residue:4563
BDBM50107768
NameBDBM50107768
Synonyms:4'-Chloro-6-methyl-biphenyl-2-carboxylic acid [2-(methanesulfonylamino-methyl)-indan-5-yl]-amide | CHEMBL142616
TypeSmall organic molecule
Emp. Form.C25H25ClN2O3S
Mol. Mass.468.996
SMILESCc1cccc(C(=O)Nc2ccc3CC(CNS(C)(=O)=O)Cc3c2)c1-c1ccc(Cl)cc1