Reaction Details
TargetApolipoprotein B-100
LigandBDBM50107775
Substrate/Competitorn/a
Meas. Tech.ChEMBL_217986 (CHEMBL824105)
IC50 1.8±n/a nM
Citation Ksander, GMdeJesus, RYuan, AFink, CMoskal, MCarlson, EKukkola, PBilci, NWallace, ENeubert, AFeldman, DMogelesky, TPoirier, KJeune, MSteele, RWasvery, JStephan, ZCahill, EWebb, RNavarrete, ALee, WGibson, JAlexander, NSharif, HHospattankar, A Diaminoindanes as microsomal triglyceride transfer protein inhibitors. J Med Chem44:4677-87 (2001) Apolipoprotein B-100
Name:Apolipoprotein B-100
Type:PROTEIN
Mol. Mass.:515630.53
Organism:Homo sapiens (Human)
Description:ChEMBL_217986
Residue:4563
BDBM50107775
NameBDBM50107775
Synonyms:4-{5-[(6-Methyl-4'-trifluoromethyl-biphenyl-2-carbonyl)-amino]-indan-2-yl}-piperazine-1-carboxylic acid methyl ester | CHEMBL422295
TypeSmall organic molecule
Emp. Form.C30H30F3N3O3
Mol. Mass.537.5727
SMILESCOC(=O)N1CCN(CC1)[C@H]1Cc2ccc(NC(=O)c3cccc(C)c3-c3ccc(cc3)C(F)(F)F)cc2C1