Reaction Details
TargetApolipoprotein B-100
LigandBDBM50107803
Substrate/Competitorn/a
Meas. Tech.ChEMBL_217986 (CHEMBL824105)
IC50 1.6±n/a nM
Citation Ksander, GMdeJesus, RYuan, AFink, CMoskal, MCarlson, EKukkola, PBilci, NWallace, ENeubert, AFeldman, DMogelesky, TPoirier, KJeune, MSteele, RWasvery, JStephan, ZCahill, EWebb, RNavarrete, ALee, WGibson, JAlexander, NSharif, HHospattankar, A Diaminoindanes as microsomal triglyceride transfer protein inhibitors. J Med Chem44:4677-87 (2001) Apolipoprotein B-100
Name:Apolipoprotein B-100
Type:PROTEIN
Mol. Mass.:515630.53
Organism:Homo sapiens (Human)
Description:ChEMBL_217986
Residue:4563
BDBM50107803
NameBDBM50107803
Synonyms:6-Methyl-4'-trifluoromethyl-biphenyl-2-carboxylic acid [7-(thiophene-2-sulfonylamino)-6,7,8,9-tetrahydro-5H-benzocyclohepten-2-yl]-amide | CHEMBL142272
TypeSmall organic molecule
Emp. Form.C30H27F3N2O3S2
Mol. Mass.584.672
SMILESCc1cccc(C(=O)Nc2ccc3CCC(CCc3c2)NS(=O)(=O)c2cccs2)c1-c1ccc(cc1)C(F)(F)F