Reaction Details
TargetApolipoprotein B-100
LigandBDBM50107804
Substrate/Competitorn/a
Meas. Tech.ChEMBL_217986 (CHEMBL824105)
IC50 1.6±n/a nM
Citation Ksander, GMdeJesus, RYuan, AFink, CMoskal, MCarlson, EKukkola, PBilci, NWallace, ENeubert, AFeldman, DMogelesky, TPoirier, KJeune, MSteele, RWasvery, JStephan, ZCahill, EWebb, RNavarrete, ALee, WGibson, JAlexander, NSharif, HHospattankar, A Diaminoindanes as microsomal triglyceride transfer protein inhibitors. J Med Chem44:4677-87 (2001) Apolipoprotein B-100
Name:Apolipoprotein B-100
Type:PROTEIN
Mol. Mass.:515630.53
Organism:Homo sapiens (Human)
Description:ChEMBL_217986
Residue:4563
BDBM50107804
NameBDBM50107804
Synonyms:CHEMBL142975 | {2-[(6-Methyl-4'-trifluoromethyl-biphenyl-2-carbonyl)-amino]-6,7,8,9-tetrahydro-5H-benzocyclohepten-7-yl}-carbamic acid methyl ester
TypeSmall organic molecule
Emp. Form.C28H27F3N2O3
Mol. Mass.496.5208
SMILESCOC(=O)NC1CCc2ccc(NC(=O)c3cccc(C)c3-c3ccc(cc3)C(F)(F)F)cc2CC1