Reaction Details
TargetApolipoprotein B-100
LigandBDBM50107814
Substrate/Competitorn/a
Meas. Tech.ChEMBL_217986 (CHEMBL824105)
IC50 5.2±n/a nM
Citation Ksander, GMdeJesus, RYuan, AFink, CMoskal, MCarlson, EKukkola, PBilci, NWallace, ENeubert, AFeldman, DMogelesky, TPoirier, KJeune, MSteele, RWasvery, JStephan, ZCahill, EWebb, RNavarrete, ALee, WGibson, JAlexander, NSharif, HHospattankar, A Diaminoindanes as microsomal triglyceride transfer protein inhibitors. J Med Chem44:4677-87 (2001) Apolipoprotein B-100
Name:Apolipoprotein B-100
Type:PROTEIN
Mol. Mass.:515630.53
Organism:Homo sapiens (Human)
Description:ChEMBL_217986
Residue:4563
BDBM50107814
NameBDBM50107814
Synonyms:CHEMBL142731 | {5-[(4'-Trifluoromethyl-biphenyl-2-carbonyl)-amino]-indan-2-yl}-carbamic acid methyl ester
TypeSmall organic molecule
Emp. Form.C25H21F3N2O3
Mol. Mass.454.441
SMILESCOC(=O)N[C@@H]1Cc2ccc(NC(=O)c3ccccc3-c3ccc(cc3)C(F)(F)F)cc2C1