Reaction Details
TargetApolipoprotein B-100
LigandBDBM50107815
Substrate/Competitorn/a
Meas. Tech.ChEMBL_217986 (CHEMBL824105)
IC50 1.9±n/a nM
Citation Ksander, GMdeJesus, RYuan, AFink, CMoskal, MCarlson, EKukkola, PBilci, NWallace, ENeubert, AFeldman, DMogelesky, TPoirier, KJeune, MSteele, RWasvery, JStephan, ZCahill, EWebb, RNavarrete, ALee, WGibson, JAlexander, NSharif, HHospattankar, A Diaminoindanes as microsomal triglyceride transfer protein inhibitors. J Med Chem44:4677-87 (2001) Apolipoprotein B-100
Name:Apolipoprotein B-100
Type:PROTEIN
Mol. Mass.:515630.53
Organism:Homo sapiens (Human)
Description:ChEMBL_217986
Residue:4563
BDBM50107815
NameBDBM50107815
Synonyms:6-Methyl-4'-trifluoromethyl-biphenyl-2-carboxylic acid {2-[(thiophene-2-sulfonylamino)-methyl]-indan-5-yl}-amide | CHEMBL143626
TypeSmall organic molecule
Emp. Form.C29H25F3N2O3S2
Mol. Mass.570.646
SMILESCc1cccc(C(=O)Nc2ccc3CC(CNS(=O)(=O)c4cccs4)Cc3c2)c1-c1ccc(cc1)C(F)(F)F