Reaction Details
TargetAdenosine receptor A2a
LigandBDBM50108020
Substrate/Competitorn/a
Meas. Tech.ChEMBL_31502 (CHEMBL647487)
Ki 0.13±n/a nM
Citation Baraldi, PGCacciari, BRomagnoli, RSpalluto, GMonopoli, AOngini, EVarani, KBorea, PA 7-Substituted 5-amino-2-(2-furyl)pyrazolo[4,3-e]-1,2,4-triazolo[1,5-c]pyrimidines as A2A adenosine receptor antagonists: a study on the importance of modifications at the side chain on the activity and solubility. J Med Chem45:115-26 (2001) Adenosine receptor A2a
Name:Adenosine receptor A2a
Type:G Protein-Coupled Receptor (GPCR)
Mol. Mass.:44716.46
Organism:Homo sapiens (Human)
Description:P29274
Residue:412
BDBM50108020
NameBDBM50108020
Synonyms:7-(3-(4-(aminomethyl)phenyl)propyl)-2-(furan-2-yl)-7H-pyrazolo[4,3-e][1,2,4]triazolo[1,5-c]pyrimidin-5-amine CHEMBL22320
TypeSmall organic molecule
Emp. Form.C20H20N8O
Mol. Mass.388.4258
SMILESNCc1ccc(CCCn2ncc3c2nc(N)n2nc(nc32)-c2ccco2)cc1