Reaction Details
TargetAdenosine receptor A2a
LigandBDBM50108027
Substrate/Competitorn/a
Meas. Tech.ChEMBL_31502 (CHEMBL647487)
Ki 0.59±n/a nM
Citation Baraldi, PGCacciari, BRomagnoli, RSpalluto, GMonopoli, AOngini, EVarani, KBorea, PA 7-Substituted 5-amino-2-(2-furyl)pyrazolo[4,3-e]-1,2,4-triazolo[1,5-c]pyrimidines as A2A adenosine receptor antagonists: a study on the importance of modifications at the side chain on the activity and solubility. J Med Chem45:115-26 (2001) Adenosine receptor A2a
Name:Adenosine receptor A2a
Type:G Protein-Coupled Receptor (GPCR)
Mol. Mass.:44716.46
Organism:Homo sapiens (Human)
Description:P29274
Residue:412
BDBM50108027
NameBDBM50108027
Synonyms:4-(2-(5-amino-2-(furan-2-yl)-7H-pyrazolo[4,3-e][1,2,4]triazolo[1,5-c]pyrimidin-7-yl)ethyl)-N,N-bis(2-chloroethyl)benzenesulfonamide CHEMBL278805
TypeSmall organic molecule
Emp. Form.C22H22Cl2N8O3S
Mol. Mass.549.433
SMILESNc1nc2n(CCc3ccc(cc3)S(=O)(=O)N(CCCl)CCCl)ncc2c2nc(nn12)-c1ccco1