Reaction Details
TargetMatrix metalloproteinase-9
LigandBDBM50108163
Substrate/Competitorn/a
Meas. Tech.ChEMBL_105522 (CHEMBL715231)
IC50 0.300000±n/a nM
Citation Wada, CKHolms, JHCurtin, MLDai, YFlorjancic, ASGarland, RBGuo, YHeyman, HRStacey, JRSteinman, DHAlbert, DHBouska, JJElmore, INGoodfellow, CLMarcotte, PATapang, PMorgan, DWMichaelides, MRDavidsen, SK Phenoxyphenyl sulfone N-formylhydroxylamines (retrohydroxamates) as potent, selective, orally bioavailable matrix metalloproteinase inhibitors. J Med Chem45:219-32 (2001) Matrix metalloproteinase-9
Name:Matrix metalloproteinase-9
Type:Enzyme
Mol. Mass.:78452.28
Organism:Homo sapiens (Human)
Description:P14780
Residue:707
BDBM50108163
NameBDBM50108163
Synonyms:CHEMBL309329 | N-Hydroxy-N-{1-(2-hydroxy-ethoxymethyl)-2-[4-(4-trifluoromethoxy-phenoxy)-benzenesulfonyl]-ethyl}-formamide
TypeSmall organic molecule
Emp. Form.C19H20F3NO8S
Mol. Mass.479.424
SMILESOCCOCC(CS(=O)(=O)c1ccc(Oc2ccc(OC(F)(F)F)cc2)cc1)N(O)C=O