Reaction Details
TargetIntegrin alpha-4/beta-7
LigandBDBM50108215
Substrate/Competitorn/a
Meas. Tech.ChEMBL_217608 (CHEMBL818378)
IC50 41±n/a nM
Citation Lin, LSLanza, TMcCauley, EVan Riper, GKidambi, UCao, JEgger, LAMumford, RASchmidt, JAMacCoss, MHagmann, WK Specific and dual antagonists of alpha(4)beta(1) and alpha(4)beta(7) integrins. Bioorg Med Chem Lett12:133-6 (2001) Integrin alpha-4/beta-7
Name:Integrin alpha-4/beta-7
Type:Protein Complex
Mol. Mass.:n/a
Description:The assay uses stably transfected K562 cells expressing human alpha4beta7 integrin.
Components:This complex has 2 components.
Component 1
Name:Integrin alpha-4
Synonyms:CD49 antigen-like family member D CD49d antigen ITA4_HUMAN Integrin alpha-4 Integrin alpha-IV VLA-4 integrin alpha 4 precursor | integrin alpha-4 precursor
Type:Membrane Protein
Mol. Mass.:114897.35
Organism:Homo sapiens (Human)
Description:P13612
Residue:1032
Component 2
Name:Integrin beta-7
Synonyms:ITB7_HUMAN Integrin alpha-4/beta-7 Integrin beta7
Type:Membrane Protein
Mol. Mass.:86893.88
Organism:Homo sapiens (Human)
Description:P26010
Residue:798
BDBM50108215
NameBDBM50108215
Synonyms:(S)-3-(2'-Cyano-biphenyl-4-yl)-2-{[(2S,3S)-1-(3,5-dichloro-benzenesulfonyl)-3-hydroxy-pyrrolidine-2-carbonyl]-amino}-propionic acid | CHEMBL430931
TypeSmall organic molecule
Emp. Form.C27H23Cl2N3O6S
Mol. Mass.588.459
SMILESO[C@H]1CCN([C@@H]1C(=O)N[C@@H](Cc1ccc(cc1)-c1ccccc1C#N)C(O)=O)S(=O)(=O)c1cc(Cl)cc(Cl)c1