Reaction Details
TargetMitogen-activated protein kinase kinase kinase 11
LigandBDBM50108293
Substrate/Competitorn/a
Meas. Tech.ChEBML_122394
IC50 11±n/a nM
Citation Murakata, CKaneko, MGessner, GAngeles, TSAtor, MAO'Kane, TMMcKenna, BAThomas, BAMathiasen, JRSaporito, MSBozyczko-Coyne, DHudkins, RL Mixed lineage kinase activity of indolocarbazole analogues. Bioorg Med Chem Lett12:147-50 (2001) Mitogen-activated protein kinase kinase kinase 11
Name:Mitogen-activated protein kinase kinase kinase 11
Type:PROTEIN
Mol. Mass.:92696.93
Organism:Homo sapiens (Human)
Description:ChEMBL_1460565
Residue:847
BDBM50108293
NameBDBM50108293
Synonyms:CHEMBL277817 | Indolocarbazole analogue
TypeSmall organic molecule
Emp. Form.C33H33N3O7
Mol. Mass.583.631
SMILESCCOCc1ccc2n3[C@H]4C[C@](O)(C(=O)OC)[C@](C)(O4)n4c5ccc(COCC)cc5c5c6CNC(=O)c6c(c2c1)c3c45