Reaction Details
TargetMitogen-activated protein kinase kinase kinase 10
LigandBDBM50108298
Substrate/Competitorn/a
Meas. Tech.ChEBML_122392
IC50 627±n/a nM
Citation Murakata, CKaneko, MGessner, GAngeles, TSAtor, MAO'Kane, TMMcKenna, BAThomas, BAMathiasen, JRSaporito, MSBozyczko-Coyne, DHudkins, RL Mixed lineage kinase activity of indolocarbazole analogues. Bioorg Med Chem Lett12:147-50 (2001) Mitogen-activated protein kinase kinase kinase 10
Name:Mitogen-activated protein kinase kinase kinase 10
Type:PROTEIN
Mol. Mass.:103699.30
Organism:Homo sapiens (Human)
Description:ChEMBL_1460564
Residue:954
BDBM50108298
NameBDBM50108298
Synonyms:CHEMBL29709 | Indolocarbazole analogue
TypeSmall organic molecule
Emp. Form.C37H41N3O5S2
Mol. Mass.671.869
SMILESCCCCSCc1ccc2n3[C@H]4C[C@](O)(C(=O)OC)[C@](C)(O4)n4c5ccc(CSCCCC)cc5c5c6CNC(=O)c6c(c2c1)c3c45