Reaction Details
TargetMitogen-activated protein kinase kinase kinase 9
LigandBDBM50108300
Substrate/Competitorn/a
Meas. Tech.ChEBML_122391
IC50 360±n/a nM
Citation Murakata, CKaneko, MGessner, GAngeles, TSAtor, MAO'Kane, TMMcKenna, BAThomas, BAMathiasen, JRSaporito, MSBozyczko-Coyne, DHudkins, RL Mixed lineage kinase activity of indolocarbazole analogues. Bioorg Med Chem Lett12:147-50 (2001) Mitogen-activated protein kinase kinase kinase 9
Name:Mitogen-activated protein kinase kinase kinase 9
Type:protein
Mol. Mass.:121881.51
Organism:Homo sapiens (Human)
Description:P80192
Residue:1104
BDBM50108300
NameBDBM50108300
Synonyms:CHEMBL38338 | Indolocarbazole analogue
TypeSmall organic molecule
Emp. Form.C37H43N5O5S2
Mol. Mass.701.898
SMILESCOC(=O)[C@@]1(O)C[C@H]2O[C@]1(C)n1c3ccc(CSCCN(C)C)cc3c3c4CNC(=O)c4c4c5cc(CSCCN(C)C)ccc5n2c4c13