Reaction Details
TargetMitogen-activated protein kinase kinase kinase 11
LigandBDBM50108297
Substrate/Competitorn/a
Meas. Tech.ChEBML_122394
IC50 31±n/a nM
Citation Murakata, CKaneko, MGessner, GAngeles, TSAtor, MAO'Kane, TMMcKenna, BAThomas, BAMathiasen, JRSaporito, MSBozyczko-Coyne, DHudkins, RL Mixed lineage kinase activity of indolocarbazole analogues. Bioorg Med Chem Lett12:147-50 (2001) Mitogen-activated protein kinase kinase kinase 11
Name:Mitogen-activated protein kinase kinase kinase 11
Type:PROTEIN
Mol. Mass.:92696.93
Organism:Homo sapiens (Human)
Description:ChEMBL_1460565
Residue:847
BDBM50108297
NameBDBM50108297
Synonyms:CHEMBL288816 | Indolocarbazole analogue
TypeSmall organic molecule
Emp. Form.C35H37N3O5S2
Mol. Mass.643.815
SMILESCOC(=O)[C@@]1(O)C[C@H]2O[C@]1(C)n1c3ccc(CSC(C)C)cc3c3c4CNC(=O)c4c4c5cc(CSC(C)C)ccc5n2c4c13