Reaction Details
Target5-hydroxytryptamine receptor 2C
LigandBDBM50108306
Substrate/Competitorn/a
Meas. Tech.ChEMBL_2729 (CHEMBL617289)
Ki 3.9±n/a nM
Citation Chang-Fong, JAddo, JDukat, MSmith, CMitchell, NAHerrick-Davis, KTeitler, MGlennon, RA Evaluation of isotryptamine derivatives at 5-HT(2) serotonin receptors. Bioorg Med Chem Lett12:155-8 (2001) 5-hydroxytryptamine receptor 2C
Name:5-hydroxytryptamine receptor 2C
Type:G Protein-Coupled Receptor (GPCR)
Mol. Mass.:51836.79
Organism:Homo sapiens (Human)
Description:P28335
Residue:458
BDBM50108306
NameBDBM50108306
Synonyms:(S)-1-(5,6-difluoro-1H-indol-1-yl)propan-2-amine CHEMBL40726
TypeSmall organic molecule
Emp. Form.C11H12F2N2
Mol. Mass.210.2232
SMILESC[C@H](N)Cn1ccc2cc(F)c(F)cc12