Reaction Details
Target5-hydroxytryptamine receptor 2A
LigandBDBM50108309
Substrate/Competitorn/a
Meas. Tech.ChEMBL_2312 (CHEMBL617519)
Ki 3±n/a nM
Citation Chang-Fong, JAddo, JDukat, MSmith, CMitchell, NAHerrick-Davis, KTeitler, MGlennon, RA Evaluation of isotryptamine derivatives at 5-HT(2) serotonin receptors. Bioorg Med Chem Lett12:155-8 (2001) 5-hydroxytryptamine receptor 2A
Name:5-hydroxytryptamine receptor 2A
Type:undefined
Mol. Mass.:52607.65
Organism:Homo sapiens (Human)
Description:P28223
Residue:471
BDBM50108309
NameBDBM50108309
Synonyms:2-(3H-Benzo[e]indol-1-yl)-1-methyl-ethylamine | CHEMBL40815
TypeSmall organic molecule
Emp. Form.C15H16N2
Mol. Mass.224.3009
SMILESCC(N)Cc1c[nH]c2ccc3ccccc3c12