Reaction Details
TargetIntegrin alpha-4/beta-1
LigandBDBM50108339
Substrate/Competitorn/a
Meas. Tech.ChEMBL_217307 (CHEMBL823928)
IC50 0.260000±n/a nM
Citation Chang, LLTruong, QMumford, RAEgger, LAKidambi, ULyons, KMcCauley, EVan Riper, GVincent, SSchmidt, JAMacCoss, MHagmann, WK The discovery of small molecule carbamates as potent dual alpha(4)beta(1)/alpha(4)beta(7) integrin antagonists. Bioorg Med Chem Lett12:159-63 (2001) Integrin alpha-4/beta-1
Name:Integrin alpha-4/beta-1
Type:n/a
Mol. Mass.:n/a
Description:ASSAY_ID of EBI is 88912
Components:This complex has 2 components.
Component 1
Name:Integrin beta-1
Synonyms:CD_antigen=CD29 Fibronectin receptor beta GPIIA ITGB1 MDF2 | MSK12
Type:Enzyme
Mol. Mass.:88400.38
Organism:Homo sapiens (Human)
Description:P05556
Residue:798
Component 2
Name:Integrin alpha-4
Synonyms:CD49 antigen-like family member D CD49d antigen ITA4_HUMAN Integrin alpha-4 Integrin alpha-IV VLA-4 integrin alpha 4 precursor | integrin alpha-4 precursor
Type:Membrane Protein
Mol. Mass.:114897.35
Organism:Homo sapiens (Human)
Description:P13612
Residue:1032
BDBM50108339
NameBDBM50108339
Synonyms:(S)-3-(4-Cyanomethoxy-phenyl)-2-{[(S)-1-(3,5-dichloro-benzenesulfonyl)-pyrrolidine-2-carbonyl]-amino}-propionic acid | CHEMBL43558
TypeSmall organic molecule
Emp. Form.C22H21Cl2N3O6S
Mol. Mass.526.39
SMILESOC(=O)[C@H](Cc1ccc(OCC#N)cc1)NC(=O)[C@@H]1CCCN1S(=O)(=O)c1cc(Cl)cc(Cl)c1