Reaction Details
TargetAcetylcholinesterase
LigandBDBM50022775
Substrate/Competitorn/a
Meas. Tech.ChEBML_28306
IC50 2±n/a nM
Citation Grove, SJKaur, JMuir, AWPow, ETarver, GJZhang, MQ Oxyaniliniums as acetylcholinesterase inhibitors for the reversal of neuromuscular block. Bioorg Med Chem Lett12:193-6 (2001) Acetylcholinesterase
Name:Acetylcholinesterase
Type:Enzyme
Mol. Mass.:67792.70
Organism:Homo sapiens (Human)
Description:P22303
Residue:614
BDBM50022775
NameBDBM50022775
Synonyms:(m-Hydroxyphenyl)trimethylammonium dimethylcarbamate 3-[(dimethylcarbamoyl)oxy]-N,N,N-trimethylanilinium CHEMBL278020 Eustigmine Neostigmine (2) Vagostigmine | m-Trimethylammoniumphenyldimethylcarbamate
TypeSmall organic molecule
Emp. Form.C12H19N2O2
Mol. Mass.223.2909
SMILESCN(C)C(=O)Oc1cccc(c1)[N+](C)(C)C