Reaction Details
TargetDelta-type opioid receptor
LigandBDBM50108439
Substrate/Competitorn/a
Meas. Tech.ChEBML_145327
IC50 639±n/a nM
Citation Semple, GAndersson, BMChhajlani, VGeorgsson, JJohansson, MLindschoten, MPontén, FRosenquist, ASörensen, HSwanson, LSwanson, M 3-Aryl pyridone derivatives. Potent and selective kappa opioid receptor agonists. Bioorg Med Chem Lett12:197-200 (2001) Delta-type opioid receptor
Name:Delta-type opioid receptor
Type:G Protein-Coupled Receptor (GPCR)
Mol. Mass.:40382.98
Organism:Homo sapiens (Human)
Description:Competition binding assays were carried out using membrane preparations from transfected HN9.10 cells that constitutively expressed the delta opioid receptor.
Residue:372
BDBM50108439
NameBDBM50108439
Synonyms:1-(1-Phenyl-2-pyrrolidin-1-yl-ethyl)-3-m-tolyl-1H-pyridin-2-one | CHEMBL302684
TypeSmall organic molecule
Emp. Form.C24H26N2O
Mol. Mass.358.476
SMILESCc1cccc(c1)-c1cccn(C(CN2CCCC2)c2ccccc2)c1=O