Reaction Details
TargetDelta-type opioid receptor
LigandBDBM50108446
Substrate/Competitorn/a
Meas. Tech.ChEBML_145327
IC50 5214±n/a nM
Citation Semple, GAndersson, BMChhajlani, VGeorgsson, JJohansson, MLindschoten, MPontén, FRosenquist, ASörensen, HSwanson, LSwanson, M 3-Aryl pyridone derivatives. Potent and selective kappa opioid receptor agonists. Bioorg Med Chem Lett12:197-200 (2001) Delta-type opioid receptor
Name:Delta-type opioid receptor
Type:G Protein-Coupled Receptor (GPCR)
Mol. Mass.:40382.98
Organism:Homo sapiens (Human)
Description:Competition binding assays were carried out using membrane preparations from transfected HN9.10 cells that constitutively expressed the delta opioid receptor.
Residue:372
BDBM50108446
NameBDBM50108446
Synonyms:3-(4-Methoxy-phenyl)-1-(1-phenyl-2-pyrrolidin-1-yl-ethyl)-1H-pyridin-2-one | CHEMBL305552
TypeSmall organic molecule
Emp. Form.C24H26N2O2
Mol. Mass.374.4754
SMILESCOc1ccc(cc1)-c1cccn(C(CN2CCCC2)c2ccccc2)c1=O