Reaction Details
TargetMu-type opioid receptor
LigandBDBM50108442
Substrate/Competitorn/a
Meas. Tech.ChEBML_145604
IC50 2680±n/a nM
Citation Semple, GAndersson, BMChhajlani, VGeorgsson, JJohansson, MLindschoten, MPontén, FRosenquist, ASörensen, HSwanson, LSwanson, M 3-Aryl pyridone derivatives. Potent and selective kappa opioid receptor agonists. Bioorg Med Chem Lett12:197-200 (2001) Mu-type opioid receptor
Name:Mu-type opioid receptor
Type:G Protein-Coupled Receptor (GPCR)
Mol. Mass.:44789.51
Organism:Homo sapiens (Human)
Description:P35372
Residue:400
BDBM50108442
NameBDBM50108442
Synonyms:3-Naphthalen-2-yl-1-(1-phenyl-2-pyrrolidin-1-yl-ethyl)-1H-pyridin-2-one | CHEMBL304404
TypeSmall organic molecule
Emp. Form.C27H26N2O
Mol. Mass.394.5081
SMILESO=c1c(cccn1C(CN1CCCC1)c1ccccc1)-c1ccc2ccccc2c1