Reaction Details
TargetMu-type opioid receptor
LigandBDBM50108432
Substrate/Competitorn/a
Meas. Tech.ChEBML_145604
IC50>5000±n/a nM
Citation Semple, GAndersson, BMChhajlani, VGeorgsson, JJohansson, MLindschoten, MPontén, FRosenquist, ASörensen, HSwanson, LSwanson, M 3-Aryl pyridone derivatives. Potent and selective kappa opioid receptor agonists. Bioorg Med Chem Lett12:197-200 (2001) Mu-type opioid receptor
Name:Mu-type opioid receptor
Type:G Protein-Coupled Receptor (GPCR)
Mol. Mass.:44789.51
Organism:Homo sapiens (Human)
Description:P35372
Residue:400
BDBM50108432
NameBDBM50108432
Synonyms:3-(2,5-Dimethoxy-phenyl)-1-(1-phenyl-2-pyrrolidin-1-yl-ethyl)-1H-pyridin-2-one | CHEMBL64197
TypeSmall organic molecule
Emp. Form.C25H28N2O3
Mol. Mass.404.5014
SMILESCOc1ccc(OC)c(c1)-c1cccn(C(CN2CCCC2)c2ccccc2)c1=O