Reaction Details
Target5-hydroxytryptamine receptor 1A
LigandBDBM50108654
Substrate/Competitorn/a
Meas. Tech.ChEMBL_1564 (CHEMBL616351)
IC50>1000±n/a nM
Citation Maier, CAWünsch, B Novel spiropiperidines as highly potent and subtype selective sigma-receptor ligands. Part 1. J Med Chem45:438-48 (2002) 5-hydroxytryptamine receptor 1A
Name:5-hydroxytryptamine receptor 1A
Type:Enzyme
Mol. Mass.:46192.09
Organism:Mus musculus (Mouse)
Description:Q64264
Residue:421
BDBM50108654
NameBDBM50108654
Synonyms:1-[3-methoxyspiro[3,4-dihydro-1H-isochromene-1,4'-(hexahydropyridine)]-1-yl]-3-phenylpropane | CHEMBL138458
TypeSmall organic molecule
Emp. Form.C23H29NO2
Mol. Mass.351.4819
SMILESCOC1Cc2ccccc2C2(CCN(CCCc3ccccc3)CC2)O1