Reaction Details
TargetPepsin A
LigandBDBM50108797
Substrate/Competitorn/a
Meas. Tech.ChEMBL_153988 (CHEMBL762339)
IC50 200±n/a nM
Citation Bursavich, MGRich, DH Designing non-peptide peptidomimetics in the 21st century: inhibitors targeting conformational ensembles. J Med Chem45:541-58 (2002) Pepsin A
Name:Pepsin A
Type:Enzyme
Mol. Mass.:41232.87
Organism:Porcine
Description:n/a
Residue:385
BDBM50108797
NameBDBM50108797
Synonyms:3-(4-Bromo-benzyloxy)-4-phenyl-piperidine | CHEMBL358699
TypeSmall organic molecule
Emp. Form.C18H20BrNO
Mol. Mass.346.262
SMILESBrc1ccc(CO[C@H]2CNCC[C@@H]2c2ccccc2)cc1