Reaction Details
TargetCruzipain
LigandBDBM50108868
Substrate/Competitorn/a
Meas. Tech.ChEMBL_51847 (CHEMBL664070)
Ki 15±n/a nM
Citation Huang, LLee, AEllman, JA Identification of potent and selective mechanism-based inhibitors of the cysteine protease cruzain using solid-phase parallel synthesis. J Med Chem45:676-84 (2002) Cruzipain
Name:Cruzipain
Type:Protein
Mol. Mass.:49831.41
Organism:Trypanosoma cruzi
Description:P25779
Residue:467
BDBM50108868
NameBDBM50108868
Synonyms:CHEMBL351721 benzyl (S)-1-((S)-4-(2-(methylamino)-2-oxoethylthio)-3-oxo-1-phenylbutan-2-ylamino)-1-oxo-3-phenylpropan-2-ylcarbamate
TypeSmall organic molecule
Emp. Form.C30H33N3O5S
Mol. Mass.547.665
SMILESCNC(=O)CSCC(=O)[C@H](Cc1ccccc1)NC(=O)[C@H](Cc1ccccc1)NC(=O)OCc1ccccc1