Reaction Details
TargetCatechol O-methyltransferase
LigandBDBM50108878
Substrate/Competitorn/a
Meas. Tech.ChEMBL_47066 (CHEMBL661107)
IC50 3.7±n/a nM
Citation Learmonth, DAVieira-Coelho, MABenes, JAlves, PCBorges, NFreitas, APda-Silva, PS Synthesis of 1-(3,4-dihydroxy-5-nitrophenyl)-2-phenyl-ethanone and derivatives as potent and long-acting peripheral inhibitors of catechol-O-methyltransferase. J Med Chem45:685-95 (2002) Catechol O-methyltransferase
Name:Catechol O-methyltransferase
Type:Enzyme
Mol. Mass.:29594.09
Organism:Rattus norvegicus (Rat)
Description:n/a
Residue:264
BDBM50108878
NameBDBM50108878
Synonyms:1-(3,4-Dihydroxy-5-nitro-phenyl)-2-phenyl-ethanone CHEMBL160038 | NEBICAPONE
TypeSmall organic molecule
Emp. Form.C14H11NO5
Mol. Mass.273.2408
SMILESOc1cc(cc(c1O)[N+]([O-])=O)C(=O)Cc1ccccc1