Reaction Details
Target5-hydroxytryptamine receptor 1A
LigandBDBM50109058
Substrate/Competitorn/a
Meas. Tech.ChEMBL_677 (CHEMBL616261)
IC50 33±n/a nM
Citation Mewshaw, REMeagher, KLZhou, PZhou, DShi, XScerni, RSmith, DSchechter, LEAndree, TH Studies toward the discovery of the next generation of antidepressants. Part 2: incorporating a 5-HT(1A) antagonist component into a class of serotonin reuptake inhibitors. Bioorg Med Chem Lett12:307-10 (2002) 5-hydroxytryptamine receptor 1A
Name:5-hydroxytryptamine receptor 1A
Type:n/a
Mol. Mass.:46122.49
Organism:Homo sapiens (Human)
Description:n/a
Residue:422
BDBM50109058
NameBDBM50109058
Synonyms:1H-4-indolyl 2-[4-(1H-3-indolyl)-1,2,3,6-tetrahydro-1-pyridinyl]ethyl ether | CHEMBL421027
TypeSmall organic molecule
Emp. Form.C23H23N3O
Mol. Mass.357.4482
SMILESC(CN1CCC(=CC1)c1c[nH]c2ccccc12)Oc1cccc2[nH]ccc12