Reaction Details
Target5-hydroxytryptamine receptor 1A
LigandBDBM50109059
Substrate/Competitorn/a
Meas. Tech.ChEMBL_677 (CHEMBL616261)
IC50 920±n/a nM
Citation Mewshaw, REMeagher, KLZhou, PZhou, DShi, XScerni, RSmith, DSchechter, LEAndree, TH Studies toward the discovery of the next generation of antidepressants. Part 2: incorporating a 5-HT(1A) antagonist component into a class of serotonin reuptake inhibitors. Bioorg Med Chem Lett12:307-10 (2002) 5-hydroxytryptamine receptor 1A
Name:5-hydroxytryptamine receptor 1A
Type:n/a
Mol. Mass.:46122.49
Organism:Homo sapiens (Human)
Description:n/a
Residue:422
BDBM50109059
NameBDBM50109059
Synonyms:3-{1-[2-(2,3-Dihydro-benzo[1,4]dioxin-5-yloxy)-ethyl]-piperidin-4-yl}-6-fluoro-1H-indole | CHEMBL322915
TypeSmall organic molecule
Emp. Form.C23H25FN2O3
Mol. Mass.396.4546
SMILESFc1ccc2c(c[nH]c2c1)C1CCN(CCOc2cccc3OCCOc23)CC1