Reaction Details
TargetSodium-dependent serotonin transporter
LigandBDBM50109060
Substrate/Competitorn/a
Meas. Tech.ChEBML_201366
Ki 94±n/a nM
Citation Mewshaw, REMeagher, KLZhou, PZhou, DShi, XScerni, RSmith, DSchechter, LEAndree, TH Studies toward the discovery of the next generation of antidepressants. Part 2: incorporating a 5-HT(1A) antagonist component into a class of serotonin reuptake inhibitors. Bioorg Med Chem Lett12:307-10 (2002) Sodium-dependent serotonin transporter
Name:Sodium-dependent serotonin transporter
Type:Multi-pass membrane protein
Mol. Mass.:70322.51
Organism:Homo sapiens (Human)
Description:P31645
Residue:630
BDBM50109060
NameBDBM50109060
Synonyms:5-{2-[4-(1H-Indol-3-yl)-3,6-dihydro-2H-pyridin-1-yl]-ethoxy}-quinoline | CHEMBL318604
TypeSmall organic molecule
Emp. Form.C24H23N3O
Mol. Mass.369.4589
SMILESC(CN1CCC(=CC1)c1c[nH]c2ccccc12)Oc1cccc2ncccc12