Reaction Details
TargetInterstitial collagenase
LigandBDBM50031795
Substrate/Competitorn/a
Meas. Tech.ChEBML_106112
IC50 3±n/a nM
Citation Yamamoto, MIkeda, SKondo, HInoue, S Design and synthesis of dual inhibitors for matrix metalloproteinase and cathepsin. Bioorg Med Chem Lett12:375-8 (2002) Interstitial collagenase
Name:Interstitial collagenase
Type:Enzyme
Mol. Mass.:54010.26
Organism:Homo sapiens (Human)
Description: P03956
Residue:469
BDBM50031795
NameBDBM50031795
Synonyms:(N-(2-HYDROXAMATEMETHYLENE-4-METHYL-PENTOYL)PHENYLALANYL)METHYL AMINE (R)-N4-hydroxy-2-isobutyl-N1-((S)-1-(methylamino)-1-oxo-3-phenylpropan-2-yl)succinamide METHYLAMINO-PHENYLALANYL-LEUCYL-HYDROXAMIC ACID
TypeSmall organic molecule
Emp. Form.C18H27N3O4
Mol. Mass.349.4247
SMILESCNC(=O)[C@H](Cc1ccccc1)NC(=O)[C@H](CC(C)C)CC(=O)NO