Reaction Details
TargetProcathepsin L
LigandBDBM50109171
Substrate/Competitorn/a
Meas. Tech.ChEBML_48493
IC50 3±n/a nM
Citation Yamamoto, MIkeda, SKondo, HInoue, S Design and synthesis of dual inhibitors for matrix metalloproteinase and cathepsin. Bioorg Med Chem Lett12:375-8 (2002) Procathepsin L
Name:Procathepsin L
Type:Enzyme
Mol. Mass.:37557.19
Organism:Homo sapiens (Human)
Description:Purchased from Calbiochem (San Diego, CA).
Residue:333
BDBM50109171
NameBDBM50109171
Synonyms:CHEMBL122591 | [(S)-1-((S)-1-Methyl-2-oxo-ethylcarbamoyl)-2-phenyl-ethyl]-carbamic acid benzyl ester
TypeSmall organic molecule
Emp. Form.C20H22N2O4
Mol. Mass.354.3997
SMILESC[C@H](NC(=O)[C@H](Cc1ccccc1)NC(=O)OCc1ccccc1)C=O