Reaction Details
TargetNeuropeptide Y receptor type 1
LigandBDBM50109178
Substrate/Competitorn/a
Meas. Tech.ChEBML_143825
Ki 89±n/a nM
Citation Poindexter, GSBruce, MALeBoulluec, KLMonkovic, IMartin, SWParker, EMIben, LGMcGovern, RTOrtiz, AAStanley, JAMattson, GKKozlowski, MArcuri, MAntal-Zimanyi, I Dihydropyridine neuropeptide Y Y(1) receptor antagonists. Bioorg Med Chem Lett12:379-82 (2002) Neuropeptide Y receptor type 1
Name:Neuropeptide Y receptor type 1
Type:Enzyme Catalytic Domain
Mol. Mass.:44399.07
Organism:Homo sapiens (Human)
Description:NPY-Y1 NPY1R HUMAN::P25929
Residue:384
BDBM50109178
NameBDBM50109178
Synonyms:2,6-Dimethyl-4-(3-{3-[3-(4-phenyl-piperidin-1-yl)-propyl]-ureido}-phenyl)-1,4-dihydro-pyridine-3,5-dicarboxylic acid 3-ethyl ester 5-methyl ester | CHEMBL341329
TypeSmall organic molecule
Emp. Form.C33H42N4O5
Mol. Mass.574.7104
SMILESCCOC(=O)C1=C(C)N=C(C)C(C1c1cccc(NC(=O)NCCCN2CCC(CC2)c2ccccc2)c1)C(=O)OC