Reaction Details
TargetNeuropeptide Y receptor type 1
LigandBDBM50109192
Substrate/Competitorn/a
Meas. Tech.ChEBML_143825
Ki 105±n/a nM
Citation Poindexter, GSBruce, MALeBoulluec, KLMonkovic, IMartin, SWParker, EMIben, LGMcGovern, RTOrtiz, AAStanley, JAMattson, GKKozlowski, MArcuri, MAntal-Zimanyi, I Dihydropyridine neuropeptide Y Y(1) receptor antagonists. Bioorg Med Chem Lett12:379-82 (2002) Neuropeptide Y receptor type 1
Name:Neuropeptide Y receptor type 1
Type:Enzyme Catalytic Domain
Mol. Mass.:44399.07
Organism:Homo sapiens (Human)
Description:NPY-Y1 NPY1R HUMAN::P25929
Residue:384
BDBM50109192
NameBDBM50109192
Synonyms:4-[3-(3-{3-[4-(2-Methoxy-phenyl)-piperazin-1-yl]-propyl}-ureido)-phenyl]-2,6-dimethyl-1,4-dihydro-pyridine-3,5-dicarboxylic acid 3-ethyl ester 5-methyl ester CHEMBL338296
TypeSmall organic molecule
Emp. Form.C33H43N5O6
Mol. Mass.605.7244
SMILESCCOC(=O)C1=C(C)N=C(C)C(C1c1cccc(NC(=O)NCCCN2CCN(CC2)c2ccccc2OC)c1)C(=O)OC