Reaction Details
TargetGonadotropin-releasing hormone receptor
LigandBDBM50109235
Substrate/Competitorn/a
Meas. Tech.ChEBML_71438
Ki 1.1±n/a nM
Citation Zhu, YFWilcoxen, KSaunders, JGuo, ZGao, YConnors, PJGross, TDTucci, FCStruthers, RSReinhart, GJXie, QChen, C A novel synthesis of 2-arylpyrrolo[1,2-a]pyrimid-7-ones and their structure-activity relationships as potent GnRH receptor antagonists. Bioorg Med Chem Lett12:403-6 (2002) Gonadotropin-releasing hormone receptor
Name:Gonadotropin-releasing hormone receptor
Type:Enzyme
Mol. Mass.:37749.45
Organism:Homo sapiens (Human)
Description:P30968
Residue:328
BDBM50109235
NameBDBM50109235
Synonyms:7-(4-Butyrylamino-phenyl)-1-(2-fluoro-benzyl)-6-{[methyl-(2-pyridin-2-yl-ethyl)-amino]-methyl}-4-oxo-1,4-dihydro-pyrrolo[1,2-a]pyrimidine-3-carboxylic acid (3-phenyl-propyl)-amide | CHEMBL130558
TypeSmall organic molecule
Emp. Form.C43H45FN6O3
Mol. Mass.712.8542
SMILESCCCC(=O)Nc1ccc(cc1)-c1cc2n(Cc3ccccc3F)cc(C(=O)NCCCc3ccccc3)c(=O)n2c1CN(C)CCc1ccccn1